{"text_format":"1","workbook":"xlsx","n_sheets":11,"sheets":["Cover","Instructions","Hazard Glossary","Risk Matrix","Information","Assumptions","Hazard Data Entry","Data Scores","Risk Summary","Vulnerability Report","Contacts"],"not_rendered":{"charts":6,"images":9,"macros":1,"external_links":0,"defined_names":17,"comments":0,"pivot_tables":0},"unopened":[],"bounds":{"document_bytes":16777216,"sheet_cells":100000,"rows_first":2000,"rows_last":500,"rows_between":2000,"halvings":0,"cell_chars":16384,"cell_head_chars":4096},"cells_cut":0,"cells_raw":0,"read":"whole","date_system":"1900"}

{"sheet":"Cover","index":0,"n_rows":28,"n_cols":13,"rows_kept":28,"cut":false,"hidden":false,"merged":[[27,12,27,16]]}
[]
[]
[]
[]
[]
[]
[null,null,"Herramienta Rápida de Estimación del Riesgo"]
[]
[]
[]
{"$rows_left_out":19}
{"sheet":"Instructions","index":1,"n_rows":198,"n_cols":2,"rows_kept":198,"cut":false,"hidden":false,"merged":[]}
[{"$f":"MdlTle","v":"Herramienta Rápida de Estimación del Riesgo"}]
[{"$f":"MID(CELL(\"filename\",A1),FIND(\"]\",CELL(\"filename\",A1))+1,255)","v":"Instructions"}]
[]
[]
[null,"Una ciudad resiliente es aquella capaz de resistir, absorber, adaptarse y recuperarse de los impactos de amenazas de manera oportuna y eficiente, lo que incluye la preservación y restauración de sus estructuras y funciones básicas."]
[]
[null,"Propósito del Marco de Toma de Decisiones "]
[]
[null,"La herramienta rápida de estimación del riesgo ha sido diseñada con el propósito de identificar y entender los riesgos/presión/impactos y exposición actuales y futuros  de los activos físicos y humanos. La herramienta rápida de estimación del riesgo no es una evaluación completa del riesgo, sino un proceso de compromiso de los actores clave para establecer una base de entendimiento común. Tomando en cuenta las acciones y las medidas correctivas realizadas, la herramienta generará una evaluación de riesgo en forma de panel de control, asesorando los riesgos y amenazas a activos físicos y humanos, impacto de los principales riesgos identificados y peligros asociados a un lugar o activo específicos. "]
[null,"La herramienta rápida de estimación del riesgo utiliza la clasificación de peligros definidos por la Oficina de las Naciones Unidas para la Reducción del Riesgo de Desastres (UNISDR). Los indicadores incluidos en la herramienta se encuentran alineados con los 10 Aspectos Esenciales de la Campaña Mundial Desarrollando Ciudades Resilientes, en el contexto del Marco de Sendai para la Reducción del Riesgo de Desastres 2015-2030 y en los Objetivos de Desarrollo sostenible."]
{"$rows_left_out":189}
{"sheet":"Hazard Glossary","index":2,"n_rows":90,"n_cols":16384,"rows_kept":90,"cut":false,"hidden":false,"merged":[]}
[{"$f":"MdlTle","v":"Herramienta Rápida de Estimación del Riesgo"}]
[{"$f":"MID(CELL(\"filename\",A1),FIND(\"]\",CELL(\"filename\",A1))+1,255)","v":"Hazard Glossary"}]
[]
[]
[null,"Accidente aéreo","Para actualizarse"]
[null,"Accidente de navegación","Para actualizarse"]
[null,"Accidente de tráfico","Para actualizarse"]
[null,"Accidente ferroviario","Para actualizarse"]
[null,"Acción de ola","Las ondas de superficie generadas por el viento que pueden ocurrir en la superficie de cualquier cuerpo de agua abierto como océanos, ríos y lagos, etc. El tamaño de la ola depende de la fuerza del viento y de la distancia recorrida."]
[null,"Actividad volcánica","Tipo de evento volcánico cerca de una abertura / ventilación en la superficie de la Tierra incluyendo erupciones volcánicas de lava, ceniza, vapor caliente, gas y material piroclástico."]
{"$rows_left_out":81}
{"sheet":"Risk Matrix","index":3,"n_rows":56,"n_cols":9,"rows_kept":56,"cut":false,"hidden":false,"merged":[[25,6,26,6],[25,5,26,5],[25,3,25,4],[8,1,12,1],[25,1,25,2]]}
[{"$f":"MdlTle","v":"Herramienta Rápida de Estimación del Riesgo"}]
[{"$f":"MID(CELL(\"filename\",A1),FIND(\"]\",CELL(\"filename\",A1))+1,255)","v":"Risk Matrix"}]
[]
[]
[]
[]
[null,"Escala de Probabilidad",null,null,"Muy Baja","Baja","Moderada","Alta","Muy Alta"]
[null,"Calificación de Probabilidad",null,null,"0 - 2","2 - 4","4 - 6","6 - 8","8 - 10"]
[null,"Gravedad\nPuntaje de gravedad promedio ponderado (basado en las respuestas proporcionadas para las medidas de vulnerabilidad, exposición y respuesta)","Insignificante","0 - 10","VL1","VL2","L3","L4","M5"]
[null,null,"Menor","11 - 25","VL2","L3","L4","M5","M6"]
{"$rows_left_out":47}
{"sheet":"Information","index":4,"n_rows":24,"n_cols":3,"rows_kept":24,"cut":false,"hidden":false,"merged":[]}
[{"$f":"MdlTle","v":"Herramienta Rápida de Estimación del Riesgo"}]
[{"$f":"MID(CELL(\"filename\",A1),FIND(\"]\",CELL(\"filename\",A1))+1,255)","v":"Information"}]
[]
[]
[]
[]
[]
[]
[]
[]
{"$rows_left_out":15}
{"sheet":"Assumptions","index":5,"n_rows":162,"n_cols":6,"rows_kept":162,"cut":false,"hidden":false,"merged":[]}
[{"$f":"MdlTle","v":"Herramienta Rápida de Estimación del Riesgo"}]
[{"$f":"MID(CELL(\"filename\",A1),FIND(\"]\",CELL(\"filename\",A1))+1,255)","v":"Assumptions"}]
[]
[]
["Supuestos generales"]
[]
[]
[null,"Proporción de probabilidad",null,"%",null,0.5]
[null,"Puntaje / rango máximo",null,"#",null,10]
[null,"Ponderación de vulnerabilidad",null,"%",null,0.25]
{"$rows_left_out":153}
{"sheet":"Hazard Data Entry","index":6,"n_rows":54,"n_cols":14,"rows_kept":54,"cut":false,"hidden":false,"merged":[[4,1,5,1],[4,4,4,7],[4,2,5,2],[4,13,5,13],[4,3,5,3],[4,9,5,9],[4,12,5,12]]}
[{"$f":"MdlTle","v":"Herramienta Rápida de Estimación del Riesgo"}]
[{"$f":"MID(CELL(\"filename\",A1),FIND(\"]\",CELL(\"filename\",A1))+1,255)","v":"Hazard Data Entry"}]
[]
[]
[null,"Familia de peligros","Eventos de peligro","Clasificaciones de exposición","Clasificación de vulnerabilidad",null,null,null,"Total vulnerability rating","Nivel actual de medidas de respuesta emprendidas o vigentes","Proporción de probabilidad","Clasificación de gravedad","Resultado de la matriz de riesgo","Comentarios y justificaciones"]
[null,null,null,null,"Infraestructura","Sectrores productivos","Servicios básicos o escenciales","Aspectos sociales y humanos","1 (bajo) - 100 (alto)",null,"1 (bajo) - 10 (alto)","1 (bajo) - 100 (alto)"]
[null,"H1 - Geofísicos"]
[null,null,null,null,null,null,null,null,{"$f":"IFERROR((((INDEX(Assumptions!$F$28:$F$38,MATCH(E8,Vulnerabilties,0))*Assumptions!$F$10)+(INDEX(Assumptions!$F$28:$F$38,MATCH(F8,Vulnerabilties,0))*Assumptions!$F$10)+(INDEX(Assumptions!$F$28:$F$38,MATCH(G8,Vulnerabilties,0))*Assumptions!$F$10)+(INDEX(Assumptions!$F$28:$F$38,MATCH(H8,Vulnerabilties,0))*Assumptions!$F$10))*Assumptions!$F$9),0)","v":0},null,{"$f":"IFERROR(INDEX(Assumptions!$F$15:$F$25,MATCH(D8,Exposures,0)*Assumptions!$F$8+(I8/Assumptions!$F$9)*Assumptions!$F$8),0)","v":0},{"$f":"IFERROR((K8*Assumptions!$F$9)-(INDEX(Assumptions!$F$41:$F$51,MATCH(J8,Levels_of_response,0))*Assumptions!$F$9),0)","v":0},{"$f":"IF(L8<=0,\"VL1\",IFERROR(INDEX('Risk Matrix'!$G$28:$G$53,MATCH(SUMPRODUCT(('Risk Matrix'!$B$28:$B$53<=L8)*('Risk Matrix'!$C$28:$C$53>=L8)*('Risk Matrix'!$D$28:$D$53<=K8)*('Risk Matrix'!$E$28:$E$53>=K8)*('Risk Matrix'!$F$28:$F$53)),'Risk Matrix'!$F$28:$F$53,0)),0))","v":"VL1"}]
[null,null,null,null,null,null,null,null,{"$f":"IFERROR((((INDEX(Assumptions!$F$28:$F$38,MATCH(E9,Vulnerabilties,0))*Assumptions!$F$10)+(INDEX(Assumptions!$F$28:$F$38,MATCH(F9,Vulnerabilties,0))*Assumptions!$F$10)+(INDEX(Assumptions!$F$28:$F$38,MATCH(G9,Vulnerabilties,0))*Assumptions!$F$10)+(INDEX(Assumptions!$F$28:$F$38,MATCH(H9,Vulnerabilties,0))*Assumptions!$F$10))*Assumptions!$F$9),0)","v":0},null,{"$f":"IFERROR(INDEX(Assumptions!$F$15:$F$25,MATCH(D9,Exposures,0)*Assumptions!$F$8+(I9/Assumptions!$F$9)*Assumptions!$F$8),0)","v":0},{"$f":"IFERROR((K9*Assumptions!$F$9)-(INDEX(Assumptions!$F$41:$F$51,MATCH(J9,Levels_of_response,0))*Assumptions!$F$9),0)","v":0},{"$f":"IF(L9<=0,\"VL1\",IFERROR(INDEX('Risk Matrix'!$G$28:$G$53,MATCH(SUMPRODUCT(('Risk Matrix'!$B$28:$B$53<=L9)*('Risk Matrix'!$C$28:$C$53>=L9)*('Risk Matrix'!$D$28:$D$53<=K9)*('Risk Matrix'!$E$28:$E$53>=K9)*('Risk Matrix'!$F$28:$F$53)),'Risk Matrix'!$F$28:$F$53,0)),0))","v":"VL1"}]
[null,null,null,null,null,null,null,null,{"$f":"IFERROR((((INDEX(Assumptions!$F$28:$F$38,MATCH(E10,Vulnerabilties,0))*Assumptions!$F$10)+(INDEX(Assumptions!$F$28:$F$38,MATCH(F10,Vulnerabilties,0))*Assumptions!$F$10)+(INDEX(Assumptions!$F$28:$F$38,MATCH(G10,Vulnerabilties,0))*Assumptions!$F$10)+(INDEX(Assumptions!$F$28:$F$38,MATCH(H10,Vulnerabilties,0))*Assumptions!$F$10))*Assumptions!$F$9),0)","v":0},null,{"$f":"IFERROR(INDEX(Assumptions!$F$15:$F$25,MATCH(D10,Exposures,0)*Assumptions!$F$8+(I10/Assumptions!$F$9)*Assumptions!$F$8),0)","v":0},{"$f":"IFERROR((K10*Assumptions!$F$9)-(INDEX(Assumptions!$F$41:$F$51,MATCH(J10,Levels_of_response,0))*Assumptions!$F$9),0)","v":0},{"$f":"IF(L10<=0,\"VL1\",IFERROR(INDEX('Risk Matrix'!$G$28:$G$53,MATCH(SUMPRODUCT(('Risk Matrix'!$B$28:$B$53<=L10)*('Risk Matrix'!$C$28:$C$53>=L10)*('Risk Matrix'!$D$28:$D$53<=K10)*('Risk Matrix'!$E$28:$E$53>=K10)*('Risk Matrix'!$F$28:$F$53)),'Risk Matrix'!$F$28:$F$53,0)),0))","v":"VL1"}]
{"$rows_left_out":45}
{"sheet":"Data Scores","index":7,"n_rows":48,"n_cols":13,"rows_kept":48,"cut":false,"hidden":false,"merged":[[25,1,29,1],[30,1,34,1],[35,1,39,1],[40,1,44,1],[5,0,6,0],[5,1,9,1],[10,1,14,1],[15,1,19,1],[20,1,24,1]]}
[{"$f":"MdlTle","v":"Herramienta Rápida de Estimación del Riesgo"}]
[{"$f":"MID(CELL(\"filename\",A1),FIND(\"]\",CELL(\"filename\",A1))+1,255)","v":"Data Scores"}]
[]
[]
[null,"Familia de peligros","Desastre","Eventos de peligro","Nivel de exposición \n(1-10)",{"$f":"'Hazard Data Entry'!E6","v":"Infraestructura"},{"$f":"'Hazard Data Entry'!F6","v":"Sectrores productivos"},{"$f":"'Hazard Data Entry'!G6","v":"Servicios básicos o escenciales"},{"$f":"'Hazard Data Entry'!H6","v":"Aspectos sociales y humanos"},"Clasificación de vulnerabilidad total\n(1-100)","Medidas de respuesta actuales     (1-10)","Puntaje de probabilidad \n(1-10)","Puntaje de gravedad\n(1-100)"]
[null,{"$f":"'Hazard Data Entry'!$B$7","v":"H1 - Geofísicos"},{"$f":"'Hazard Data Entry'!B8","v":0},{"$f":"'Hazard Data Entry'!C8","v":0},{"$f":"IFERROR(INDEX(Assumptions!$F$15:$F$25,MATCH('Hazard Data Entry'!D8,Exposures,0)),0)","v":0},{"$f":"IFERROR(INDEX(Assumptions!$F$15:$F$25,MATCH('Hazard Data Entry'!E8,Exposures,0)),0)","v":0},{"$f":"IFERROR(INDEX(Assumptions!$F$15:$F$25,MATCH('Hazard Data Entry'!F8,Exposures,0)),0)","v":0},{"$f":"IFERROR(INDEX(Assumptions!$F$15:$F$25,MATCH('Hazard Data Entry'!G8,Exposures,0)),0)","v":0},{"$f":"IFERROR(INDEX(Assumptions!$F$15:$F$25,MATCH('Hazard Data Entry'!H8,Exposures,0)),0)","v":0},{"$f":"'Hazard Data Entry'!I8","v":0},{"$f":"IFERROR(INDEX(Assumptions!$F$41:$F$51,MATCH('Hazard Data Entry'!J8,Levels_of_response,0)),0)","v":0},{"$f":"'Hazard Data Entry'!K8","v":0},{"$f":"'Hazard Data Entry'!L8","v":0}]
[null,null,{"$f":"'Hazard Data Entry'!B9","v":0},{"$f":"'Hazard Data Entry'!C9","v":0},{"$f":"IFERROR(INDEX(Assumptions!$F$15:$F$25,MATCH('Hazard Data Entry'!D9,Exposures,0)),0)","v":0},{"$f":"IFERROR(INDEX(Assumptions!$F$15:$F$25,MATCH('Hazard Data Entry'!E9,Exposures,0)),0)","v":0},{"$f":"IFERROR(INDEX(Assumptions!$F$15:$F$25,MATCH('Hazard Data Entry'!F9,Exposures,0)),0)","v":0},{"$f":"IFERROR(INDEX(Assumptions!$F$15:$F$25,MATCH('Hazard Data Entry'!G9,Exposures,0)),0)","v":0},{"$f":"IFERROR(INDEX(Assumptions!$F$15:$F$25,MATCH('Hazard Data Entry'!H9,Exposures,0)),0)","v":0},{"$f":"'Hazard Data Entry'!I9","v":0},{"$f":"IFERROR(INDEX(Assumptions!$F$41:$F$51,MATCH('Hazard Data Entry'!J9,Levels_of_response,0)),0)","v":0},{"$f":"'Hazard Data Entry'!K9","v":0},{"$f":"'Hazard Data Entry'!L9","v":0}]
[null,null,{"$f":"'Hazard Data Entry'!B10","v":0},{"$f":"'Hazard Data Entry'!C10","v":0},{"$f":"IFERROR(INDEX(Assumptions!$F$15:$F$25,MATCH('Hazard Data Entry'!D10,Exposures,0)),0)","v":0},{"$f":"IFERROR(INDEX(Assumptions!$F$15:$F$25,MATCH('Hazard Data Entry'!E10,Exposures,0)),0)","v":0},{"$f":"IFERROR(INDEX(Assumptions!$F$15:$F$25,MATCH('Hazard Data Entry'!F10,Exposures,0)),0)","v":0},{"$f":"IFERROR(INDEX(Assumptions!$F$15:$F$25,MATCH('Hazard Data Entry'!G10,Exposures,0)),0)","v":0},{"$f":"IFERROR(INDEX(Assumptions!$F$15:$F$25,MATCH('Hazard Data Entry'!H10,Exposures,0)),0)","v":0},{"$f":"'Hazard Data Entry'!I10","v":0},{"$f":"IFERROR(INDEX(Assumptions!$F$41:$F$51,MATCH('Hazard Data Entry'!J10,Levels_of_response,0)),0)","v":0},{"$f":"'Hazard Data Entry'!K10","v":0},{"$f":"'Hazard Data Entry'!L10","v":0}]
[null,null,{"$f":"'Hazard Data Entry'!B11","v":0},{"$f":"'Hazard Data Entry'!C11","v":0},{"$f":"IFERROR(INDEX(Assumptions!$F$15:$F$25,MATCH('Hazard Data Entry'!D11,Exposures,0)),0)","v":0},{"$f":"IFERROR(INDEX(Assumptions!$F$15:$F$25,MATCH('Hazard Data Entry'!E11,Exposures,0)),0)","v":0},{"$f":"IFERROR(INDEX(Assumptions!$F$15:$F$25,MATCH('Hazard Data Entry'!F11,Exposures,0)),0)","v":0},{"$f":"IFERROR(INDEX(Assumptions!$F$15:$F$25,MATCH('Hazard Data Entry'!G11,Exposures,0)),0)","v":0},{"$f":"IFERROR(INDEX(Assumptions!$F$15:$F$25,MATCH('Hazard Data Entry'!H11,Exposures,0)),0)","v":0},{"$f":"'Hazard Data Entry'!I11","v":0},{"$f":"IFERROR(INDEX(Assumptions!$F$41:$F$51,MATCH('Hazard Data Entry'!J11,Levels_of_response,0)),0)","v":0},{"$f":"'Hazard Data Entry'!K11","v":0},{"$f":"'Hazard Data Entry'!L11","v":0}]
[null,null,{"$f":"'Hazard Data Entry'!B12","v":0},{"$f":"'Hazard Data Entry'!C12","v":0},{"$f":"IFERROR(INDEX(Assumptions!$F$15:$F$25,MATCH('Hazard Data Entry'!D12,Exposures,0)),0)","v":0},{"$f":"IFERROR(INDEX(Assumptions!$F$15:$F$25,MATCH('Hazard Data Entry'!E12,Exposures,0)),0)","v":0},{"$f":"IFERROR(INDEX(Assumptions!$F$15:$F$25,MATCH('Hazard Data Entry'!F12,Exposures,0)),0)","v":0},{"$f":"IFERROR(INDEX(Assumptions!$F$15:$F$25,MATCH('Hazard Data Entry'!G12,Exposures,0)),0)","v":0},{"$f":"IFERROR(INDEX(Assumptions!$F$15:$F$25,MATCH('Hazard Data Entry'!H12,Exposures,0)),0)","v":0},{"$f":"'Hazard Data Entry'!I12","v":0},{"$f":"IFERROR(INDEX(Assumptions!$F$41:$F$51,MATCH('Hazard Data Entry'!J12,Levels_of_response,0)),0)","v":0},{"$f":"'Hazard Data Entry'!K12","v":0},{"$f":"'Hazard Data Entry'!L12","v":0}]
{"$rows_left_out":39}
{"sheet":"Risk Summary","index":8,"n_rows":9,"n_cols":3,"rows_kept":9,"cut":false,"hidden":false,"merged":[]}
[null,{"$f":"MdlTle","v":"Herramienta Rápida de Estimación del Riesgo"}]
[null,{"$f":"MID(CELL(\"filename\",B1),FIND(\"]\",CELL(\"filename\",B1))+1,255)","v":"Risk Summary"}]
[]
[]
[null,{"$f":"Information!C15","v":"Locación/Región Nombre/Título: "},{"$f":"Information!$L$15","v":0}]
[null,{"$f":"Information!C17","v":"Descripción (incluyendo activo (s) examinado):"},{"$f":"Information!$L$17","v":0}]
[null,{"$f":"Information!C20","v":"Asesor (persona completando la estimación del riesgo): "},{"$f":"Information!$L$20","v":0}]
[null,{"$f":"Information!C22","v":"Día de completado: "},{"$f":"TEXT(Information!$L$22,\"DD MMM YYYY\")","v":"00 Jan 1900"}]
[null,{"$f":"Information!C24","v":"Revisión Fecha/Versión: "},{"$f":"TEXT(Information!$L$24, \"DD MMM YYYY\")","v":"00 Jan 1900"}]

{"sheet":"Vulnerability Report","index":9,"n_rows":55,"n_cols":3,"rows_kept":55,"cut":false,"hidden":false,"merged":[]}
[null,{"$f":"MdlTle","v":"Herramienta Rápida de Estimación del Riesgo"}]
[null,{"$f":"MID(CELL(\"filename\",B1),FIND(\"]\",CELL(\"filename\",B1))+1,255)","v":"Vulnerability Report"}]
[]
[]
[null,{"$f":"Information!C15","v":"Locación/Región Nombre/Título: "},{"$f":"Information!$L$15","v":0}]
[null,{"$f":"Information!C17","v":"Descripción (incluyendo activo (s) examinado):"},{"$f":"Information!$L$17","v":0}]
[null,{"$f":"Information!C20","v":"Asesor (persona completando la estimación del riesgo): "},{"$f":"Information!$L$20","v":0}]
[null,{"$f":"Information!C22","v":"Día de completado: "},{"$f":"TEXT(Information!$L$22,\"DD MMM YYYY\")","v":"00 Jan 1900"}]
[null,{"$f":"Information!C24","v":"Revisión Fecha/Versión: "},{"$f":"TEXT(Information!$L$24, \"DD MMM YYYY\")","v":"00 Jan 1900"}]
[]
{"$rows_left_out":46}
{"sheet":"Contacts","index":10,"n_rows":14,"n_cols":2,"rows_kept":14,"cut":false,"hidden":false,"merged":[[6,0,6,2]]}
[{"$f":"MdlTle","v":"Herramienta Rápida de Estimación del Riesgo"}]
[{"$f":"MID(CELL(\"filename\",A1),FIND(\"]\",CELL(\"filename\",A1))+1,255)","v":"Contacts"}]
[]
[]
[]
["¿Preguntas?"]
["Contacta a nuestro staff y socios en tu región:"]
[]
["MCR2030 Global Secretariat:","mcr2030-global@un.org"]
["MCR2030 Regional Secretariat for Africa: ","mcr2030-africa@un.org"]
{"$rows_left_out":4}