{"text_format":"1","workbook":"xlsx","n_sheets":11,"sheets":["Cover","Instructions","Hazard Glossary","Risk Matrix","Information","Assumptions","Hazard Data Entry","Data Scores","Risk Summary","Vulnerability Report","Contacts"],"not_rendered":{"charts":6,"images":5,"macros":1,"external_links":0,"defined_names":15,"comments":0,"pivot_tables":0},"unopened":[],"bounds":{"document_bytes":16777216,"sheet_cells":100000,"rows_first":2000,"rows_last":500,"rows_between":2000,"halvings":0,"cell_chars":16384,"cell_head_chars":4096},"cells_cut":0,"cells_raw":0,"read":"whole","date_system":"1900"}

{"sheet":"Cover","index":0,"n_rows":28,"n_cols":13,"rows_kept":28,"cut":false,"hidden":false,"merged":[[27,12,27,16]]}
[]
[]
[]
[]
[]
[]
[null,null,"เครื่องมือประมาณการณ์ความเสี่ยงอย่างรวดเร็ว"]
[null,null,"Quick Risk Estimation (QRE) Tool"]
[]
[]
{"$rows_left_out":19}
{"sheet":"Instructions","index":1,"n_rows":197,"n_cols":2,"rows_kept":197,"cut":false,"hidden":false,"merged":[]}
[{"$f":"MdlTle","v":"Quick Risk Estimation (QRE) Tool"}]
[{"$f":"MID(CELL(\"filename\",A1),FIND(\"]\",CELL(\"filename\",A1))+1,255)","v":"Instructions"}]
["คำแนะนำ"]
[]
[null,"เมืองที่มีความรีซีเลียนส์ (Resilient) สามารถพร้อมรับและฟื้นกลับเร็วนั้น จะสามารถลด ต้านทาน พร้อมรับมือ และฟื้นฟูตนเองจากผลกระทบความเสียหายซึ่งเกิดจากภัยได้อย่างมีประสทธิภาพและทันท่วงที เนื่องจากสามารถรักษาและฟื้นฟูโครงสร้างและบริการพื้นฐานที่จำเป็น"]
[]
[null,"กรอบวัตถุประสงค์ที่ใช้ในการตัดสินใจ (Purpose of Decision Making Framework)"]
[]
[null,"เครื่องมือประมาณการณ์ความเสี่ยงอย่างรวดเร็ว (QRE Tool)  ได้รับการออกแบบขึ้นมาเพื่อใช้บ่งชี้และสร้างความเข้าใจถึงความเสี่ยง/สถานการณ์ความตึงเครียด/ภาวะช๊อค อันที่จะเกิดขึ้นได้ทั้งในปัจจุบันและอนาคต  ซึ่งสิ่งเหล่านี้เป็นภัยคุกคามสร้างความเสียหายแก่ทั้งแก่ชีวิตมนุษย์และทรัพย์สิน ทั้งนี้ เครื่องมือ QRE ไม่ใช่เครื่องมือที่ใช้ในการประเมินความเสี่ยงอย่างเต็มรูปแบบ  หากแต่เป็นเครื่องมือสร้างกระบวนการการมีส่วนร่วมของภาคีที่เกี่ยวข้องเพื่อสร้างความเข้าใจร่วมกันในเรื่องความเสี่ยง\n \nเครื่องมือ QRE จะแสดงผลการประเมินความเสี่ยงในรูปแบบกระดานแสดงผล (dashboard-style) โดยคำนึงถึงกิจกรรมที่มาตรการที่ได้ดำเนินการไปแล้ว พร้อมสะท้อนให้เห็นถึงความเสี่ยงและภัยที่อาจเกิดขึ้นและส่งผลต่อชีวิตมนุษย์และทรัพย์สิน รวมทั้งผลกระทบของความเสี่ยงและภัยดังกล่าวในพื้นที่ และ/หรือ สินทรัพย์ใดสินทรัพย์หนึ่งที่เลือกหรือระบุไว้ในการประเมิน"]
[null,"เครื่องมือ QRE จำแนกประเภทของภัยตามที่ได้มีกำหนดไว้โดยสำนักงานเพื่อการลดความเสี่ยงภัยพิบัติแห่งองค์การสหประชาชาติ (United Nations Office for Disaster Risk Reduction หรือ UNDRR) โดยตัวชี้วัดภัยของเครื่องมือ QRE มีความสอดคล้องไปกับหลักสำคัญ 10 ประการเพื่อการสร้างเมืองให้พร้อมรับและฟื้นกลับเร็ว (10 Essential for Making Cities Resilient) ซึ่งอยู่ในสาระและบริบทของกรอบเซนไดเพื่อการลดความเสี่ยงจากภัยพิบัติปี 2015 – 2030 (Sendai Framework) และเป้าหมายการพัฒนาที่ยั่งยืน (Sustainable development Goals: SDGs)"]
{"$rows_left_out":188}
{"sheet":"Hazard Glossary","index":2,"n_rows":90,"n_cols":16384,"rows_kept":90,"cut":false,"hidden":false,"merged":[]}
[{"$f":"MdlTle","v":"Quick Risk Estimation (QRE) Tool"}]
[{"$f":"MID(CELL(\"filename\",A1),FIND(\"]\",CELL(\"filename\",A1))+1,255)","v":"Hazard Glossary"}]
["คำศัพท์เกี่ยวกับภัย"]
[]
[null,"Term","Definition"]
[null,{"$f":"Assumptions!B100","v":"การระเบิดกลางอากาศ (Airburst)"},"การระเบิดของดาวหางหรืออุกกาบาตที่เกิดขึ้นในชั้นบรรยากาศโลก"]
[null,{"$f":"Assumptions!B79","v":"ภัยจากสัตว์ (Animal incident)"},"การที่มนุษย์เผชิญหน้ากับสัตว์ดุร้ายทั้งที่เกิดขึ้นในเมืองและชนบท"]
[null,{"$f":"Assumptions!B101","v":"ขี้เถ้าร่วง (Ash fall)"},"การร่วงหล่นของขึ้เถ้าละเอียด (เส้นผ่านศูนย์กลางขนาดเล็กกว่า 4 มม.) ที่เกิดจากภูเขาไฟระเบิด และกระจายตัวในชั้นบรรยากาศโลก สามารถทรงตัวอยู่ในอากาศเป็นเวลานาน และสามารถกระจายไปได้ในวงกว้างจากต้นตอ"]
[null,{"$f":"Assumptions!B102","v":"การถล่มของหิมะ เศษหินและดิน (Avalanche/snow & debris)"},"ชิ้นส่วนขนาดใหญ่ของแผ่นโลก หิมะ หรือ น้ำแข็ง ที่เคลื่อนตัวตกลงมาจากภูเขาอย่างรวดเร็วตามแรงโน้มถ่วงของโลก\n• หิมะถล่ม (Snow avalanche) คือ การถล่มของแผ่นหิมะและน้ำแข็งอย่างรวดเร็ว\n• การถล่มของเศษหินและดิน (Debris avalanche) คือการถล่มของหินและดินจำนวนมาก แบ่งออกเป็น 2 ประเภท คือ การถล่มของเศษหินและดินแบบเย็น (Cold debris avalanche) ที่มักเกิดจากลาดหินและดินที่ไม่มั่นคง และ การถล่มของเศษหินและดินแบบร้อน (Hot debris avalanche) ที่เกิดจากการประทุของภูเขาไฟทำให้เกิดการเคลื่อนไหวของเนินดินและถล่มลงในที่สุด"]
[null,{"$f":"Assumptions!B103","v":"อุบัติเหตุการบิน (Aviation accident)"},"รอการอัพเดทข้อมูลต่อไป"]
{"$rows_left_out":81}
{"sheet":"Risk Matrix","index":3,"n_rows":56,"n_cols":13,"rows_kept":56,"cut":false,"hidden":false,"merged":[[25,6,26,6],[25,5,26,5],[25,3,25,4],[8,1,12,1],[25,1,25,2]]}
[{"$f":"MdlTle","v":"Quick Risk Estimation (QRE) Tool"}]
[{"$f":"MID(CELL(\"filename\",A1),FIND(\"]\",CELL(\"filename\",A1))+1,255)","v":"Risk Matrix"}]
["การจัดความสำคัญความเสี่ยง"]
[]
[]
[]
[null,"ระดับความเป็นไปได้ในการเกิด (likelihood ranking)",null,null,"ระดับต่ำมาก","ระดับต่ำ","ระดับปานกลาง","ระดับสูง","ระดับสูงมาก"]
[null,"คะแนนระดับความเป็นไปได้",null,null,"0 - 2","2 - 4","4 - 6","6 - 8","8 - 10"]
[null,"ความรุนแรง (Severity)\nค่าเฉลี่ยความรุนแรงแบบถ่วงน้ำหนัก (จากคำตอบเกี่ยวกับความเปราะบาง ความล่อแหลม และมาตรการการรับมือ)","แทบไม่รุนแรง","0 - 10","VL1","VL2","L3","L4","M5",null,"VL ","Very Low",{"$f":"B22","v":"ระดับต่ำมาก"}]
[null,null,"ไม่รุนแรงมาก","11 - 25","VL2","L3","L4","M5","M6",null,"L","Low",{"$f":"B21","v":"ระดับต่ำ"}]
{"$rows_left_out":47}
{"sheet":"Information","index":4,"n_rows":24,"n_cols":3,"rows_kept":24,"cut":false,"hidden":false,"merged":[[16,2,16,8]]}
[{"$f":"MdlTle","v":"Quick Risk Estimation (QRE) Tool"}]
[{"$f":"MID(CELL(\"filename\",A1),FIND(\"]\",CELL(\"filename\",A1))+1,255)","v":"Information"}]
["ข้อมูล"]
[]
[]
[]
[]
[]
[]
[]
{"$rows_left_out":15}
{"sheet":"Assumptions","index":5,"n_rows":162,"n_cols":6,"rows_kept":162,"cut":false,"hidden":false,"merged":[]}
[{"$f":"MdlTle","v":"Quick Risk Estimation (QRE) Tool"}]
[{"$f":"MID(CELL(\"filename\",A1),FIND(\"]\",CELL(\"filename\",A1))+1,255)","v":"Assumptions"}]
["สมมุติฐาน"]
[]
["สมมติฐานทั่วไป"]
[]
[]
[null,"สัดส่วนของคะแนนการจัดระดับความเป็นไปได้",null,"%",null,0.5]
[null,"คะแนน/ลำดับ  สูงสุด",null,"#",null,10]
[null,"ค่าน้ำหนัก ความเปราะบาง",null,"%",null,0.25]
{"$rows_left_out":153}
{"sheet":"Hazard Data Entry","index":6,"n_rows":54,"n_cols":14,"rows_kept":54,"cut":false,"hidden":false,"merged":[[4,1,5,1],[4,4,4,7],[4,2,5,2],[4,13,5,13],[4,3,5,3],[4,9,5,9],[4,12,5,12]]}
[{"$f":"MdlTle","v":"Quick Risk Estimation (QRE) Tool"}]
[{"$f":"MID(CELL(\"filename\",A1),FIND(\"]\",CELL(\"filename\",A1))+1,255)","v":"Hazard Data Entry"}]
["กรอกข้อมูลเกี่ยวกับภัย"]
[]
[null,{"$f":"Assumptions!B55","v":"ประเภทภัย (Hazard family)"},{"$f":"Assumptions!B99","v":"เหตุการณ์ที่เป็นภัยอันตราย (Hazard Event)"},{"$f":"Assumptions!B14","v":"ระดับความล่อแหลม (Exposure rating)"},{"$f":"Assumptions!B27","v":"ระดับความเปราะบาง (Vulnerable Rating)"},null,null,null,"จำนวนคะแนนรวมทั้งหมดของความเปราะบาง","ระดับมาตรการการรับมือที่มีอยู่ในปัจจุบัน (Response measures)","ระดับคะแนนความเป็นไปได้ในการเกิด (Likelihood ranking score)","ระดับความรุนแรง (Severity rating) ","ผลการจัดลำดับความเสี่ยง (Risk matrix output)","กล่องแสดงความคิดเห็นและเหตุผลสนับสนุน"]
[null,null,null,null,"โครงสร้างพื้นฐาน (Infrastructure)","ภาคการผลิต (Productive sectors)","ภาคการบริการพื้นฐานหรือจำเป็น (Essential or basic service)","ด้านมนุษย์และสังคม (Human and social aspects)","1 (น้อย) - 100 (มาก)",null,"1 (น้อย) - 10 (มาก)","1 (น้อย ) - 100 (มาก)"]
[null,"H1 - ภัยทางธรณีวิทยาที่สำคัญ"]
[null,null,null,null,null,null,null,null,{"$f":"IFERROR((((INDEX(Assumptions!$F$28:$F$38,MATCH(E8,Vulnerabilties,0))*Assumptions!$F$10)+(INDEX(Assumptions!$F$28:$F$38,MATCH(F8,Vulnerabilties,0))*Assumptions!$F$10)+(INDEX(Assumptions!$F$28:$F$38,MATCH(G8,Vulnerabilties,0))*Assumptions!$F$10)+(INDEX(Assumptions!$F$28:$F$38,MATCH(H8,Vulnerabilties,0))*Assumptions!$F$10))*Assumptions!$F$9),0)","v":0},null,{"$f":"IFERROR(INDEX(Assumptions!$F$15:$F$25,MATCH(D8,Exposures,0)*Assumptions!$F$8+(I8/Assumptions!$F$9)*Assumptions!$F$8),0)","v":0},{"$f":"IFERROR((K8*Assumptions!$F$9)-(INDEX(Assumptions!$F$41:$F$51,MATCH(J8,Levels_of_response,0))*Assumptions!$F$9),0)","v":0},{"$f":"IF(L8<=0,\"VL1\",IFERROR(INDEX('Risk Matrix'!$G$28:$G$53,MATCH(SUMPRODUCT(('Risk Matrix'!$B$28:$B$53<=L8)*('Risk Matrix'!$C$28:$C$53>=L8)*('Risk Matrix'!$D$28:$D$53<=K8)*('Risk Matrix'!$E$28:$E$53>=K8)*('Risk Matrix'!$F$28:$F$53)),'Risk Matrix'!$F$28:$F$53,0)),0))","v":"VL1"}]
[null,null,null,null,null,null,null,null,{"$f":"IFERROR((((INDEX(Assumptions!$F$28:$F$38,MATCH(E9,Vulnerabilties,0))*Assumptions!$F$10)+(INDEX(Assumptions!$F$28:$F$38,MATCH(F9,Vulnerabilties,0))*Assumptions!$F$10)+(INDEX(Assumptions!$F$28:$F$38,MATCH(G9,Vulnerabilties,0))*Assumptions!$F$10)+(INDEX(Assumptions!$F$28:$F$38,MATCH(H9,Vulnerabilties,0))*Assumptions!$F$10))*Assumptions!$F$9),0)","v":0},null,{"$f":"IFERROR(INDEX(Assumptions!$F$15:$F$25,MATCH(D9,Exposures,0)*Assumptions!$F$8+(I9/Assumptions!$F$9)*Assumptions!$F$8),0)","v":0},{"$f":"IFERROR((K9*Assumptions!$F$9)-(INDEX(Assumptions!$F$41:$F$51,MATCH(J9,Levels_of_response,0))*Assumptions!$F$9),0)","v":0},{"$f":"IF(L9<=0,\"VL1\",IFERROR(INDEX('Risk Matrix'!$G$28:$G$53,MATCH(SUMPRODUCT(('Risk Matrix'!$B$28:$B$53<=L9)*('Risk Matrix'!$C$28:$C$53>=L9)*('Risk Matrix'!$D$28:$D$53<=K9)*('Risk Matrix'!$E$28:$E$53>=K9)*('Risk Matrix'!$F$28:$F$53)),'Risk Matrix'!$F$28:$F$53,0)),0))","v":"VL1"}]
[null,null,null,null,null,null,null,null,{"$f":"IFERROR((((INDEX(Assumptions!$F$28:$F$38,MATCH(E10,Vulnerabilties,0))*Assumptions!$F$10)+(INDEX(Assumptions!$F$28:$F$38,MATCH(F10,Vulnerabilties,0))*Assumptions!$F$10)+(INDEX(Assumptions!$F$28:$F$38,MATCH(G10,Vulnerabilties,0))*Assumptions!$F$10)+(INDEX(Assumptions!$F$28:$F$38,MATCH(H10,Vulnerabilties,0))*Assumptions!$F$10))*Assumptions!$F$9),0)","v":0},null,{"$f":"IFERROR(INDEX(Assumptions!$F$15:$F$25,MATCH(D10,Exposures,0)*Assumptions!$F$8+(I10/Assumptions!$F$9)*Assumptions!$F$8),0)","v":0},{"$f":"IFERROR((K10*Assumptions!$F$9)-(INDEX(Assumptions!$F$41:$F$51,MATCH(J10,Levels_of_response,0))*Assumptions!$F$9),0)","v":0},{"$f":"IF(L10<=0,\"VL1\",IFERROR(INDEX('Risk Matrix'!$G$28:$G$53,MATCH(SUMPRODUCT(('Risk Matrix'!$B$28:$B$53<=L10)*('Risk Matrix'!$C$28:$C$53>=L10)*('Risk Matrix'!$D$28:$D$53<=K10)*('Risk Matrix'!$E$28:$E$53>=K10)*('Risk Matrix'!$F$28:$F$53)),'Risk Matrix'!$F$28:$F$53,0)),0))","v":"VL1"}]
{"$rows_left_out":45}
{"sheet":"Data Scores","index":7,"n_rows":48,"n_cols":13,"rows_kept":48,"cut":false,"hidden":false,"merged":[[25,1,29,1],[30,1,34,1],[35,1,39,1],[40,1,44,1],[5,0,6,0],[5,1,9,1],[10,1,14,1],[15,1,19,1],[20,1,24,1]]}
[{"$f":"MdlTle","v":"Quick Risk Estimation (QRE) Tool"}]
[{"$f":"MID(CELL(\"filename\",A1),FIND(\"]\",CELL(\"filename\",A1))+1,255)","v":"Data Scores"}]
["คะแนนที่ได้"]
[]
[null,"ประเภทภัย","ประเภทภัยย่อย","เหตุการณ์ที่เป็นภัยอันตราย","คะแนนความล่อแหลม (Exposure) \n(1-10)",{"$f":"'Hazard Data Entry'!E6","v":"โครงสร้างพื้นฐาน (Infrastructure)"},{"$f":"'Hazard Data Entry'!F6","v":"ภาคการผลิต (Productive sectors)"},{"$f":"'Hazard Data Entry'!G6","v":"ภาคการบริการพื้นฐานหรือจำเป็น (Essential or basic service)"},{"$f":"'Hazard Data Entry'!H6","v":"ด้านมนุษย์และสังคม (Human and social aspects)"},"คะแนนความเปราะบาง (Vulnerability)\n(1-100)","คะแนนระดับมาตรการการรับมือที่มีอยู่ในปัจจุบัน (Response measures)(1-10)","คะแนนความเป็นไปได้ในการเกิด (Likelihood)\n(1-10)","ระดับความรุนแรง (Severity)\n(1-100)"]
[null,{"$f":"'Hazard Data Entry'!$B$7","v":"H1 - ภัยทางธรณีวิทยาที่สำคัญ"},{"$f":"'Hazard Data Entry'!B8","v":0},{"$f":"'Hazard Data Entry'!C8","v":0},{"$f":"IFERROR(INDEX(Assumptions!$F$15:$F$25,MATCH('Hazard Data Entry'!D8,Exposures,0)),0)","v":0},{"$f":"IFERROR(INDEX(Assumptions!$F$15:$F$25,MATCH('Hazard Data Entry'!E8,Exposures,0)),0)","v":0},{"$f":"IFERROR(INDEX(Assumptions!$F$15:$F$25,MATCH('Hazard Data Entry'!F8,Exposures,0)),0)","v":0},{"$f":"IFERROR(INDEX(Assumptions!$F$15:$F$25,MATCH('Hazard Data Entry'!G8,Exposures,0)),0)","v":0},{"$f":"IFERROR(INDEX(Assumptions!$F$15:$F$25,MATCH('Hazard Data Entry'!H8,Exposures,0)),0)","v":0},{"$f":"'Hazard Data Entry'!I8","v":0},{"$f":"IFERROR(INDEX(Assumptions!$F$41:$F$51,MATCH('Hazard Data Entry'!J8,Levels_of_response,0)),0)","v":0},{"$f":"'Hazard Data Entry'!K8","v":0},{"$f":"'Hazard Data Entry'!L8","v":0}]
[null,null,{"$f":"'Hazard Data Entry'!B9","v":0},{"$f":"'Hazard Data Entry'!C9","v":0},{"$f":"IFERROR(INDEX(Assumptions!$F$15:$F$25,MATCH('Hazard Data Entry'!D9,Exposures,0)),0)","v":0},{"$f":"IFERROR(INDEX(Assumptions!$F$15:$F$25,MATCH('Hazard Data Entry'!E9,Exposures,0)),0)","v":0},{"$f":"IFERROR(INDEX(Assumptions!$F$15:$F$25,MATCH('Hazard Data Entry'!F9,Exposures,0)),0)","v":0},{"$f":"IFERROR(INDEX(Assumptions!$F$15:$F$25,MATCH('Hazard Data Entry'!G9,Exposures,0)),0)","v":0},{"$f":"IFERROR(INDEX(Assumptions!$F$15:$F$25,MATCH('Hazard Data Entry'!H9,Exposures,0)),0)","v":0},{"$f":"'Hazard Data Entry'!I9","v":0},{"$f":"IFERROR(INDEX(Assumptions!$F$41:$F$51,MATCH('Hazard Data Entry'!J9,Levels_of_response,0)),0)","v":0},{"$f":"'Hazard Data Entry'!K9","v":0},{"$f":"'Hazard Data Entry'!L9","v":0}]
[null,null,{"$f":"'Hazard Data Entry'!B10","v":0},{"$f":"'Hazard Data Entry'!C10","v":0},{"$f":"IFERROR(INDEX(Assumptions!$F$15:$F$25,MATCH('Hazard Data Entry'!D10,Exposures,0)),0)","v":0},{"$f":"IFERROR(INDEX(Assumptions!$F$15:$F$25,MATCH('Hazard Data Entry'!E10,Exposures,0)),0)","v":0},{"$f":"IFERROR(INDEX(Assumptions!$F$15:$F$25,MATCH('Hazard Data Entry'!F10,Exposures,0)),0)","v":0},{"$f":"IFERROR(INDEX(Assumptions!$F$15:$F$25,MATCH('Hazard Data Entry'!G10,Exposures,0)),0)","v":0},{"$f":"IFERROR(INDEX(Assumptions!$F$15:$F$25,MATCH('Hazard Data Entry'!H10,Exposures,0)),0)","v":0},{"$f":"'Hazard Data Entry'!I10","v":0},{"$f":"IFERROR(INDEX(Assumptions!$F$41:$F$51,MATCH('Hazard Data Entry'!J10,Levels_of_response,0)),0)","v":0},{"$f":"'Hazard Data Entry'!K10","v":0},{"$f":"'Hazard Data Entry'!L10","v":0}]
[null,null,{"$f":"'Hazard Data Entry'!B11","v":0},{"$f":"'Hazard Data Entry'!C11","v":0},{"$f":"IFERROR(INDEX(Assumptions!$F$15:$F$25,MATCH('Hazard Data Entry'!D11,Exposures,0)),0)","v":0},{"$f":"IFERROR(INDEX(Assumptions!$F$15:$F$25,MATCH('Hazard Data Entry'!E11,Exposures,0)),0)","v":0},{"$f":"IFERROR(INDEX(Assumptions!$F$15:$F$25,MATCH('Hazard Data Entry'!F11,Exposures,0)),0)","v":0},{"$f":"IFERROR(INDEX(Assumptions!$F$15:$F$25,MATCH('Hazard Data Entry'!G11,Exposures,0)),0)","v":0},{"$f":"IFERROR(INDEX(Assumptions!$F$15:$F$25,MATCH('Hazard Data Entry'!H11,Exposures,0)),0)","v":0},{"$f":"'Hazard Data Entry'!I11","v":0},{"$f":"IFERROR(INDEX(Assumptions!$F$41:$F$51,MATCH('Hazard Data Entry'!J11,Levels_of_response,0)),0)","v":0},{"$f":"'Hazard Data Entry'!K11","v":0},{"$f":"'Hazard Data Entry'!L11","v":0}]
[null,null,{"$f":"'Hazard Data Entry'!B12","v":0},{"$f":"'Hazard Data Entry'!C12","v":0},{"$f":"IFERROR(INDEX(Assumptions!$F$15:$F$25,MATCH('Hazard Data Entry'!D12,Exposures,0)),0)","v":0},{"$f":"IFERROR(INDEX(Assumptions!$F$15:$F$25,MATCH('Hazard Data Entry'!E12,Exposures,0)),0)","v":0},{"$f":"IFERROR(INDEX(Assumptions!$F$15:$F$25,MATCH('Hazard Data Entry'!F12,Exposures,0)),0)","v":0},{"$f":"IFERROR(INDEX(Assumptions!$F$15:$F$25,MATCH('Hazard Data Entry'!G12,Exposures,0)),0)","v":0},{"$f":"IFERROR(INDEX(Assumptions!$F$15:$F$25,MATCH('Hazard Data Entry'!H12,Exposures,0)),0)","v":0},{"$f":"'Hazard Data Entry'!I12","v":0},{"$f":"IFERROR(INDEX(Assumptions!$F$41:$F$51,MATCH('Hazard Data Entry'!J12,Levels_of_response,0)),0)","v":0},{"$f":"'Hazard Data Entry'!K12","v":0},{"$f":"'Hazard Data Entry'!L12","v":0}]
{"$rows_left_out":39}
{"sheet":"Risk Summary","index":8,"n_rows":9,"n_cols":3,"rows_kept":9,"cut":false,"hidden":false,"merged":[]}
[null,{"$f":"MdlTle","v":"Quick Risk Estimation (QRE) Tool"}]
[null,{"$f":"MID(CELL(\"filename\",B1),FIND(\"]\",CELL(\"filename\",B1))+1,255)","v":"Risk Summary"}]
[null,"บทสรุปความเสี่ยง"]
[]
[null,{"$f":"Information!C15","v":"ชื่อเมือง หรือ ท้องถิ่น:"},{"$f":"Information!$L$15","v":0}]
[null,{"$f":"Information!C17","v":"ข้อมูลเพิ่มเติมเกี่ยวกับเมือง (รวมทั้งรายละเอียดของภาคส่วนที่เกี่ยวข้อง และขอบเขตของการประเมิน):"},{"$f":"Information!$L$17","v":0}]
[null,{"$f":"Information!C20","v":"ผู้ทำการประเมิน:"},{"$f":"Information!$L$20","v":0}]
[null,{"$f":"Information!C22","v":"วันที่ประเมินเสร็จสิ้น: "},{"$f":"TEXT(Information!$L$22,\"DD MMM YYYY\")","v":"00 Jan 1900"}]
[null,{"$f":"Information!C24","v":"หากเป็นการประเมินซ้ำ หรือตรวจทาน โปรดระบุวันที่ตรวจทาน"},{"$f":"TEXT(Information!$L$24, \"DD MMM YYYY\")","v":"00 Jan 1900"}]

{"sheet":"Vulnerability Report","index":9,"n_rows":56,"n_cols":3,"rows_kept":56,"cut":false,"hidden":false,"merged":[]}
[null,{"$f":"MdlTle","v":"Quick Risk Estimation (QRE) Tool"}]
[null,{"$f":"MID(CELL(\"filename\",B1),FIND(\"]\",CELL(\"filename\",B1))+1,255)","v":"Vulnerability Report"}]
[null,"รายงานความเปราะบาง"]
[]
[null,{"$f":"Information!C15","v":"ชื่อเมือง หรือ ท้องถิ่น:"},{"$f":"Information!$L$15","v":0}]
[null,{"$f":"Information!C17","v":"ข้อมูลเพิ่มเติมเกี่ยวกับเมือง (รวมทั้งรายละเอียดของภาคส่วนที่เกี่ยวข้อง และขอบเขตของการประเมิน):"},{"$f":"Information!$L$17","v":0}]
[null,{"$f":"Information!C20","v":"ผู้ทำการประเมิน:"},{"$f":"Information!$L$20","v":0}]
[null,{"$f":"Information!C22","v":"วันที่ประเมินเสร็จสิ้น: "},{"$f":"TEXT(Information!$L$22,\"DD MMM YYYY\")","v":"00 Jan 1900"}]
[null,{"$f":"Information!C24","v":"หากเป็นการประเมินซ้ำ หรือตรวจทาน โปรดระบุวันที่ตรวจทาน"},{"$f":"TEXT(Information!$L$24, \"DD MMM YYYY\")","v":"00 Jan 1900"}]
[]
{"$rows_left_out":47}
{"sheet":"Contacts","index":10,"n_rows":14,"n_cols":2,"rows_kept":14,"cut":false,"hidden":false,"merged":[[6,0,6,1]]}
[{"$f":"MdlTle","v":"Quick Risk Estimation (QRE) Tool"}]
[{"$f":"MID(CELL(\"filename\",A1),FIND(\"]\",CELL(\"filename\",A1))+1,255)","v":"Contacts"}]
["ติดต่อสอบถาม"]
[]
[]
[]
["หากมีคำถามหรือข้อสงสัย สามารถติดต่อเจ้าหน้าที่ประจำภูมิภาคต่างๆ ได้ตามอีเมลด้านล่าง"]
[]
["MCR2030 Global Secretariat","mcr2030-global@un.org"]
["MCR2030 Regional Secretariat ประจำภาคพื้นแอฟริกา","mcr2030-africa@un.org"]
{"$rows_left_out":4}